Information card for entry 4504342
Formula | C18 H17 Co N3 O7 |
Calculated formula | C18 H17.004 Co N3 O7.0015 |
Title of publication | Organic‒Inorganic Hybrid Coordination Polymers Based on 6-Methylpyridine-2,4-dicarboxylic Acid N-Oxide (MPDCO) Ligand: Preparations, Interpenetrating Structures, and Magnetic and Luminescent Properties |
Authors of publication | Lin, Jian-Guo; Su, Yang; Tian, Zheng-Fang; Qiu, Ling; Wen, Li-Li; Lu, Zhen-Da; Li, Yi-Zhi; Meng, Qing-Jin |
Journal of publication | Crystal Growth & Design |
Year of publication | 2007 |
Journal volume | 7 |
Journal issue | 12 |
Pages of publication | 2526 |
a | 18.758 ± 0.004 Å |
b | 10.859 ± 0.002 Å |
c | 20.596 ± 0.004 Å |
α | 90° |
β | 114.928 ± 0.004° |
γ | 90° |
Cell volume | 3804.4 ± 1.3 Å3 |
Cell temperature | 293 ± 2 K |
Ambient diffraction temperature | 293 ± 2 K |
Number of distinct elements | 5 |
Space group number | 15 |
Hermann-Mauguin space group symbol | C 1 2/c 1 |
Hall space group symbol | -C 2yc |
Residual factor for all reflections | 0.0938 |
Residual factor for significantly intense reflections | 0.052 |
Weighted residual factors for significantly intense reflections | 0.0977 |
Weighted residual factors for all reflections included in the refinement | 0.1066 |
Goodness-of-fit parameter for all reflections included in the refinement | 0.855 |
Diffraction radiation wavelength | 0.71073 Å |
Diffraction radiation type | MoKα |