Information card for entry 4504414
Formula | C9 H28 Cl In N6 Te2 Zn |
Calculated formula | C9 H28 Cl In N6 Te2 Zn |
Title of publication | Solvothermal Synthesis of a Series of Telluridoindate Compounds Displaying Three Types of One-Dimensional Polymeric Anion Chains with the Formula {[InTe2]-}\ιnfty |
Authors of publication | Zhou, Jian; Zhang, Yong; Bian, Guo-Qing; Zhu, Qin-Yu; Li, Chun-Ying; Dai, Jie |
Journal of publication | Crystal Growth & Design |
Year of publication | 2007 |
Journal volume | 7 |
Journal issue | 9 |
Pages of publication | 1889 |
a | 28.386 ± 0.004 Å |
b | 7.5189 ± 0.0008 Å |
c | 19.822 ± 0.002 Å |
α | 90° |
β | 111.757 ± 0.003° |
γ | 90° |
Cell volume | 3929.3 ± 0.8 Å3 |
Cell temperature | 223 ± 2 K |
Ambient diffraction temperature | 223 ± 2 K |
Number of distinct elements | 7 |
Space group number | 15 |
Hermann-Mauguin space group symbol | C 1 2/c 1 |
Hall space group symbol | -C 2yc |
Residual factor for all reflections | 0.0496 |
Residual factor for significantly intense reflections | 0.0404 |
Weighted residual factors for significantly intense reflections | 0.0987 |
Weighted residual factors for all reflections included in the refinement | 0.1043 |
Goodness-of-fit parameter for all reflections included in the refinement | 1.094 |
Diffraction radiation wavelength | 0.71073 Å |
Diffraction radiation type | MoKα |