Information card for entry 4504418
Formula | C13 H52 Fe2 In4 N13 Te8 |
Calculated formula | C13 H48 Fe2 In4 N13 Te8 |
Title of publication | Solvothermal Synthesis of a Series of Telluridoindate Compounds Displaying Three Types of One-Dimensional Polymeric Anion Chains with the Formula {[InTe2]-}\ιnfty |
Authors of publication | Zhou, Jian; Zhang, Yong; Bian, Guo-Qing; Zhu, Qin-Yu; Li, Chun-Ying; Dai, Jie |
Journal of publication | Crystal Growth & Design |
Year of publication | 2007 |
Journal volume | 7 |
Journal issue | 9 |
Pages of publication | 1889 |
a | 8.7193 ± 0.0012 Å |
b | 16.186 ± 0.003 Å |
c | 17.674 ± 0.003 Å |
α | 113.825 ± 0.003° |
β | 90.17 ± 0.002° |
γ | 102.773 ± 0.002° |
Cell volume | 2213.4 ± 0.6 Å3 |
Cell temperature | 193 ± 2 K |
Ambient diffraction temperature | 193 ± 2 K |
Number of distinct elements | 6 |
Space group number | 2 |
Hermann-Mauguin space group symbol | P -1 |
Hall space group symbol | -P 1 |
Residual factor for all reflections | 0.0641 |
Residual factor for significantly intense reflections | 0.0464 |
Weighted residual factors for significantly intense reflections | 0.1001 |
Weighted residual factors for all reflections included in the refinement | 0.1117 |
Goodness-of-fit parameter for all reflections included in the refinement | 1.001 |
Diffraction radiation wavelength | 0.71073 Å |
Diffraction radiation type | MoKα |