Information card for entry 4504449
Formula | C10 H10 Ag3 Cl3 N2 S2 |
Calculated formula | C10 H10 Ag3 Cl3 N2 S2 |
Title of publication | Construction of Pyridinethiolate-Bridged 2D and 3D Coordination Networks of d10Metal Halides via Solvothermalin SituDisulfide Cleavage Reactions |
Authors of publication | Wang, Jing; Zhang, Yue-Hua; Li, Hao-Xiang; Lin, Zhuo-Jia; Tong, Ming-Liang |
Journal of publication | Crystal Growth & Design |
Year of publication | 2007 |
Journal volume | 7 |
Journal issue | 11 |
Pages of publication | 2352 |
a | 16.022 ± 0.003 Å |
b | 4.0404 ± 0.0007 Å |
c | 25.154 ± 0.004 Å |
α | 90° |
β | 90° |
γ | 90° |
Cell volume | 1628.4 ± 0.5 Å3 |
Cell temperature | 293 ± 2 K |
Ambient diffraction temperature | 293 ± 2 K |
Number of distinct elements | 6 |
Space group number | 54 |
Hermann-Mauguin space group symbol | P c c a |
Hall space group symbol | -P 2a 2ac |
Residual factor for all reflections | 0.0705 |
Residual factor for significantly intense reflections | 0.0598 |
Weighted residual factors for significantly intense reflections | 0.1396 |
Weighted residual factors for all reflections included in the refinement | 0.1457 |
Goodness-of-fit parameter for all reflections included in the refinement | 1.116 |
Diffraction radiation wavelength | 0.71073 Å |
Diffraction radiation type | MoKα |