Information card for entry 4504453
Formula | C16 H18 N4 O2 |
Calculated formula | C16 H18 N4 O2 |
SMILES | c1(cnccc1)NC(=O)CCCCC(=O)Nc1cnccc1 |
Title of publication | Comparative Structural Studies on Homologues of Amides and Reverse Amides: Unprecedented 4-fold Interpenetrated Quartz Network, New β-Sheet, and Two-Dimensional Layers |
Authors of publication | Rajput, Lalit; Singha, Subhankar; Biradha, Kumar |
Journal of publication | Crystal Growth & Design |
Year of publication | 2007 |
Journal volume | 7 |
Journal issue | 12 |
Pages of publication | 2788 |
a | 9.484 ± 0.0019 Å |
b | 7.772 ± 0.0016 Å |
c | 10.702 ± 0.002 Å |
α | 90° |
β | 108.21 ± 0.03° |
γ | 90° |
Cell volume | 749.3 ± 0.3 Å3 |
Cell temperature | 293 ± 2 K |
Ambient diffraction temperature | 293 ± 2 K |
Number of distinct elements | 4 |
Space group number | 14 |
Hermann-Mauguin space group symbol | P 1 21/n 1 |
Hall space group symbol | -P 2yn |
Residual factor for all reflections | 0.0664 |
Residual factor for significantly intense reflections | 0.0437 |
Weighted residual factors for significantly intense reflections | 0.1149 |
Weighted residual factors for all reflections included in the refinement | 0.145 |
Goodness-of-fit parameter for all reflections included in the refinement | 1.004 |
Diffraction radiation wavelength | 0.71073 Å |
Diffraction radiation type | MoKα |