Information card for entry 4504455
Formula | C20 H26 N4 O2 |
Calculated formula | C20 H26 N4 O2 |
Title of publication | Comparative Structural Studies on Homologues of Amides and Reverse Amides: Unprecedented 4-fold Interpenetrated Quartz Network, New β-Sheet, and Two-Dimensional Layers |
Authors of publication | Rajput, Lalit; Singha, Subhankar; Biradha, Kumar |
Journal of publication | Crystal Growth & Design |
Year of publication | 2007 |
Journal volume | 7 |
Journal issue | 12 |
Pages of publication | 2788 |
a | 4.8241 ± 0.001 Å |
b | 8.2326 ± 0.0016 Å |
c | 24.212 ± 0.005 Å |
α | 93.71 ± 0.03° |
β | 95.14 ± 0.03° |
γ | 105.71 ± 0.03° |
Cell volume | 918 ± 0.4 Å3 |
Cell temperature | 293 ± 2 K |
Ambient diffraction temperature | 293 ± 2 K |
Number of distinct elements | 4 |
Space group number | 2 |
Hermann-Mauguin space group symbol | P -1 |
Hall space group symbol | -P 1 |
Residual factor for all reflections | 0.1536 |
Residual factor for significantly intense reflections | 0.0623 |
Weighted residual factors for significantly intense reflections | 0.1755 |
Weighted residual factors for all reflections included in the refinement | 0.2067 |
Goodness-of-fit parameter for all reflections included in the refinement | 1.128 |
Diffraction radiation wavelength | 0.71073 Å |
Diffraction radiation type | MoKα |