Information card for entry 4504462
Formula | C24 H24 Cd N4 O4 |
Calculated formula | C24 H24 Cd N4 O4 |
Title of publication | Two- and Three-Dimensional Divalent Metal Isophthalate Coordination Polymers Incorporating Flexible Bispyridylmethylpiperazine Tethers: Structure Direction through Coordination Geometry Preferences, Carboxylate Binding Mode, and Ligand Conformation |
Authors of publication | Martin, David P.; Braverman, Maxwell A.; LaDuca, Robert L. |
Journal of publication | Crystal Growth & Design |
Year of publication | 2007 |
Journal volume | 7 |
Journal issue | 12 |
Pages of publication | 2609 |
a | 9.663 ± 0.002 Å |
b | 10.332 ± 0.003 Å |
c | 23.208 ± 0.006 Å |
α | 90° |
β | 100.398 ± 0.004° |
γ | 90° |
Cell volume | 2279 ± 1 Å3 |
Cell temperature | 293 ± 2 K |
Ambient diffraction temperature | 293 ± 2 K |
Number of distinct elements | 5 |
Space group number | 14 |
Hermann-Mauguin space group symbol | P 1 21/c 1 |
Hall space group symbol | -P 2ybc |
Residual factor for all reflections | 0.0633 |
Residual factor for significantly intense reflections | 0.0395 |
Weighted residual factors for significantly intense reflections | 0.0764 |
Weighted residual factors for all reflections included in the refinement | 0.0839 |
Goodness-of-fit parameter for all reflections included in the refinement | 1.017 |
Diffraction radiation wavelength | 0.71073 Å |
Diffraction radiation type | MoKα |