Information card for entry 4504468
Formula | C30 H114 N20 Ni8 O74 P2 W18 |
Calculated formula | C30 H100 N20 Ni8 O74 P2 W18 |
Title of publication | Two-Dimensional Extended (4,4)-Topological Network Constructed from Tetra-NiII-Substituted Sandwich-Type Keggin Polyoxometalate Building Blocks and NiII-Organic Cation Bridges |
Authors of publication | Zhao, Jun-Wei; Li, Bing; Zheng, Shou-Tian; Yang, Guo-Yu |
Journal of publication | Crystal Growth & Design |
Year of publication | 2007 |
Journal volume | 7 |
Journal issue | 12 |
Pages of publication | 2658 |
a | 13.357 ± 0.0019 Å |
b | 13.997 ± 0.002 Å |
c | 17.129 ± 0.002 Å |
α | 67.468 ± 0.004° |
β | 71.986 ± 0.005° |
γ | 88.698 ± 0.006° |
Cell volume | 2796.2 ± 0.7 Å3 |
Cell temperature | 293 ± 2 K |
Ambient diffraction temperature | 293 ± 2 K |
Number of distinct elements | 7 |
Space group number | 2 |
Hermann-Mauguin space group symbol | P -1 |
Hall space group symbol | -P 1 |
Residual factor for all reflections | 0.0514 |
Residual factor for significantly intense reflections | 0.0462 |
Weighted residual factors for significantly intense reflections | 0.1255 |
Weighted residual factors for all reflections included in the refinement | 0.1279 |
Goodness-of-fit parameter for all reflections included in the refinement | 1.02 |
Diffraction radiation wavelength | 0.71073 Å |
Diffraction radiation type | MoKα |