Information card for entry 4504844
Chemical name | 1,3-di(iso-propyl)imidazolium bromide |
Formula | C9 H17 Br N2 |
Calculated formula | C9 H17 Br N2 |
SMILES | [Br-].n1(c[n+](cc1)C(C)C)C(C)C |
Title of publication | Cocrystal of an Ionic Liquid with Organic Molecules as a Mimic of Ionic Liquid Solution |
Authors of publication | Golovanov, Denis G.; Lyssenko, Konstantin A.; Antipin, Mikhail Yu.; Vygodskii, Yakov S.; Lozinskaya, Elena I.; Shaplov, Alexander S. |
Journal of publication | Crystal Growth & Design |
Year of publication | 2005 |
Journal volume | 5 |
Journal issue | 1 |
Pages of publication | 337 |
a | 8.033 ± 0.004 Å |
b | 9.962 ± 0.005 Å |
c | 14.235 ± 0.007 Å |
α | 90° |
β | 106.328 ± 0.009° |
γ | 90° |
Cell volume | 1093.2 ± 0.9 Å3 |
Cell temperature | 110 ± 2 K |
Ambient diffraction temperature | 110 ± 2 K |
Number of distinct elements | 4 |
Space group number | 14 |
Hermann-Mauguin space group symbol | P 1 21/n 1 |
Hall space group symbol | -P 2yn |
Residual factor for all reflections | 0.0337 |
Residual factor for significantly intense reflections | 0.0263 |
Weighted residual factors for significantly intense reflections | 0.0577 |
Weighted residual factors for all reflections included in the refinement | 0.0603 |
Goodness-of-fit parameter for all reflections included in the refinement | 1.068 |
Diffraction radiation wavelength | 0.71073 Å |
Diffraction radiation type | MoKα |