Information card for entry 4504853
Formula | C14 H16 Cu O8 |
Calculated formula | C14 H8 Cu O8 |
Title of publication | Syntheses and Crystal Structures of Copper(II) Coordination Polymers Comprising Discrete Helical Chains |
Authors of publication | Wang, Ruihu; Zhou, Youfu; Sun, Yanqiong; Yuan, Daqiang; Han, Lei; Lou, Benyong; Wu, Benlai; Hong, Maochun |
Journal of publication | Crystal Growth & Design |
Year of publication | 2005 |
Journal volume | 5 |
Journal issue | 1 |
Pages of publication | 251 |
a | 14.1063 ± 0.0009 Å |
b | 7.6324 ± 0.0004 Å |
c | 15.6342 ± 0.001 Å |
α | 90° |
β | 114.183 ± 0.002° |
γ | 90° |
Cell volume | 1535.54 ± 0.16 Å3 |
Cell temperature | 293 ± 2 K |
Ambient diffraction temperature | 293 ± 2 K |
Number of distinct elements | 4 |
Space group number | 14 |
Hermann-Mauguin space group symbol | P 1 21/n 1 |
Hall space group symbol | -P 2yn |
Residual factor for all reflections | 0.0829 |
Residual factor for significantly intense reflections | 0.0778 |
Weighted residual factors for significantly intense reflections | 0.1886 |
Weighted residual factors for all reflections included in the refinement | 0.1918 |
Goodness-of-fit parameter for all reflections included in the refinement | 1.256 |
Diffraction radiation wavelength | 0.71073 Å |
Diffraction radiation type | MoKα |