Information card for entry 4504856
Common name | en-pillared layered zinc hydroxysulphate |
Formula | C H16 N O13 S Zn4 |
Calculated formula | C0.99 H9.96 N O12.97 S Zn4 |
Title of publication | Synthesis and Characterization of Subcell−Supercell Related Ethylenediamine-Pillared Zinc Hydroxysulfates |
Authors of publication | Rujiwatra, Apinpus; Mander, Gavin J.; Kepert, Cameron J.; Rosseinsky, Matthew J. |
Journal of publication | Crystal Growth & Design |
Year of publication | 2005 |
Journal volume | 5 |
Journal issue | 1 |
Pages of publication | 183 |
a | 8.2881 ± 0.0019 Å |
b | 8.2881 ± 0.0019 Å |
c | 10.566 ± 0.003 Å |
α | 90° |
β | 90° |
γ | 120° |
Cell volume | 628.6 ± 0.3 Å3 |
Cell temperature | 150 ± 2 K |
Ambient diffraction temperature | 150 ± 2 K |
Number of distinct elements | 6 |
Space group number | 147 |
Hermann-Mauguin space group symbol | P -3 |
Hall space group symbol | -P 3 |
Residual factor for all reflections | 0.0549 |
Residual factor for significantly intense reflections | 0.0463 |
Weighted residual factors for significantly intense reflections | 0.1152 |
Weighted residual factors for all reflections included in the refinement | 0.1188 |
Goodness-of-fit parameter for all reflections included in the refinement | 1.08 |
Diffraction radiation wavelength | 0.6941 Å |
Diffraction radiation type | Synchrotron |