Information card for entry 4504903
Chemical name | 6(4)-O-CAMPHORSULPHONYL 2,4(6)DIBENZOYL MYO-INOSITOL 1,3,5 ORTHOFORMATE |
Formula | C32.38 H34.75 Cl2.75 O11 S |
Calculated formula | C32.375 H34.75 Cl2.75 O11 S |
Title of publication | Short SO···CO Contacts Associate Diastereomers of 2,4(6)-Di-O-benzoyl-6(4)-O-[(1S)-10-camphorsulfonyl]-myo-inositol 1,3,5-Orthoformate in Their Inclusion Complexes |
Authors of publication | Manoj, K.; Sureshan, Kana M.; Gonnade, Rajesh G.; Bhadbhade, Mohan M.; Shashidhar, Mysore S. |
Journal of publication | Crystal Growth & Design |
Year of publication | 2005 |
Journal volume | 5 |
Journal issue | 3 |
Pages of publication | 833 |
a | 30.561 ± 0.017 Å |
b | 10.925 ± 0.006 Å |
c | 22.255 ± 0.012 Å |
α | 90° |
β | 114.922 ± 0.01° |
γ | 90° |
Cell volume | 6739 ± 6 Å3 |
Cell temperature | 133 ± 2 K |
Ambient diffraction temperature | 133 ± 2 K |
Number of distinct elements | 5 |
Space group number | 5 |
Hermann-Mauguin space group symbol | C 1 2 1 |
Hall space group symbol | C 2y |
Residual factor for all reflections | 0.1248 |
Residual factor for significantly intense reflections | 0.0905 |
Weighted residual factors for significantly intense reflections | 0.199 |
Weighted residual factors for all reflections included in the refinement | 0.2186 |
Goodness-of-fit parameter for all reflections included in the refinement | 1.072 |
Diffraction radiation wavelength | 0.71073 Å |
Diffraction radiation type | MoKα |