Information card for entry 4504943
Common name | 1R (1PBA)(C6(CN)6) |
Formula | C26 H20 N10 |
Calculated formula | C26 H20 N10 |
Title of publication | Structural Transference and Regulation of Bimodal Assembly of Charge-Assisted Hydrogen-Bonded Networks |
Authors of publication | Lee, Sang-Ok; Shacklady, Danielle M.; Horner, Matthew J.; Ferlay, Sylvie; Hosseini, Mir W.; Ward, Michael D. |
Journal of publication | Crystal Growth & Design |
Year of publication | 2005 |
Journal volume | 5 |
Journal issue | 3 |
Pages of publication | 995 |
a | 12.1332 ± 0.0015 Å |
b | 16.798 ± 0.002 Å |
c | 46.658 ± 0.006 Å |
α | 90° |
β | 90° |
γ | 90° |
Cell volume | 9510 ± 2 Å3 |
Cell temperature | 173 ± 2 K |
Ambient diffraction temperature | 173 ± 2 K |
Number of distinct elements | 3 |
Space group number | 43 |
Hermann-Mauguin space group symbol | F d d 2 |
Hall space group symbol | F 2 -2d |
Residual factor for all reflections | 0.0804 |
Residual factor for significantly intense reflections | 0.0747 |
Weighted residual factors for significantly intense reflections | 0.1992 |
Weighted residual factors for all reflections included in the refinement | 0.2068 |
Goodness-of-fit parameter for all reflections included in the refinement | 1.049 |
Diffraction radiation wavelength | 0.71073 Å |
Diffraction radiation type | MoKα |