Information card for entry 4505001
Chemical name | 2-aminopyridinium 4-nitrophenolate . 4-nitrophenol ? |
Formula | C17 H16 N4 O6 |
Calculated formula | C17 H16 N4 O6 |
Title of publication | SHG Active Salts of 4-Nitrophenolate with H-Bonded Helical Formations: Structure-Directing Role ofortho-Aminopyridines |
Authors of publication | Prakash, M. Jaya; Radhakrishnan, T. P. |
Journal of publication | Crystal Growth & Design |
Year of publication | 2005 |
Journal volume | 5 |
Journal issue | 2 |
Pages of publication | 721 |
a | 13.1347 ± 0.0016 Å |
b | 10.912 ± 0.002 Å |
c | 12.203 ± 0.002 Å |
α | 90° |
β | 90° |
γ | 90° |
Cell volume | 1749 ± 0.5 Å3 |
Cell temperature | 293 ± 2 K |
Ambient diffraction temperature | 293 ± 2 K |
Number of distinct elements | 4 |
Space group number | 33 |
Hermann-Mauguin space group symbol | P n a 21 |
Hall space group symbol | P 2c -2n |
Residual factor for all reflections | 0.1222 |
Residual factor for significantly intense reflections | 0.0447 |
Weighted residual factors for significantly intense reflections | 0.1153 |
Weighted residual factors for all reflections included in the refinement | 0.1154 |
Goodness-of-fit parameter for all reflections included in the refinement | 0.961 |
Diffraction radiation wavelength | 0.71073 Å |
Diffraction radiation type | MoKα |