Information card for entry 4505212
Formula | C28 H24 Ag2 F6 O6 S6 |
Calculated formula | C28.002 H24 Ag2 F6 O6 S6 |
Title of publication | Silver Coodination Polymers with Flexible Ligands. Syntheses, Crystal Structures, and Effect of the Counteranion and the Solvent on the Structure of Complexes [AgL1X]∞of the Bis(Phenylthio)methane LigandL1with Silver(I) Salts, X = ClO4-, BF4-, CF3COO-, CF3SO3-, CF3CF2CF2COO-, and-OOCCF2CF2COO- |
Authors of publication | Awaleh, Mohamed Osman; Badia, Antonella; Brisse, François |
Journal of publication | Crystal Growth & Design |
Year of publication | 2005 |
Journal volume | 5 |
Journal issue | 5 |
Pages of publication | 1897 |
a | 12.526 ± 0.002 Å |
b | 12.905 ± 0.002 Å |
c | 13.186 ± 0.002 Å |
α | 109.48 ± 0.02° |
β | 109.36 ± 0.02° |
γ | 100.79 ± 0.02° |
Cell volume | 1786.5 ± 0.7 Å3 |
Cell temperature | 220 ± 2 K |
Ambient diffraction temperature | 220 ± 2 K |
Number of distinct elements | 6 |
Space group number | 2 |
Hermann-Mauguin space group symbol | P -1 |
Hall space group symbol | -P 1 |
Residual factor for all reflections | 0.0561 |
Residual factor for significantly intense reflections | 0.048 |
Weighted residual factors for significantly intense reflections | 0.1313 |
Weighted residual factors for all reflections included in the refinement | 0.1364 |
Goodness-of-fit parameter for all reflections included in the refinement | 1.017 |
Diffraction radiation wavelength | 1.54178 Å |
Diffraction radiation type | CuKα |