Information card for entry 4505214
Formula | C30 H24 Ag2 F4 O4 S4 |
Calculated formula | C30 H24 Ag2 F4 O4 S4 |
Title of publication | Silver Coodination Polymers with Flexible Ligands. Syntheses, Crystal Structures, and Effect of the Counteranion and the Solvent on the Structure of Complexes [AgL1X]∞of the Bis(Phenylthio)methane LigandL1with Silver(I) Salts, X = ClO4-, BF4-, CF3COO-, CF3SO3-, CF3CF2CF2COO-, and-OOCCF2CF2COO- |
Authors of publication | Awaleh, Mohamed Osman; Badia, Antonella; Brisse, François |
Journal of publication | Crystal Growth & Design |
Year of publication | 2005 |
Journal volume | 5 |
Journal issue | 5 |
Pages of publication | 1897 |
a | 10.9903 ± 0.0002 Å |
b | 11.3039 ± 0.0002 Å |
c | 13.0694 ± 0.0002 Å |
α | 99.339 ± 0.001° |
β | 90.383 ± 0.001° |
γ | 99.491 ± 0.001° |
Cell volume | 1579.27 ± 0.05 Å3 |
Cell temperature | 100 ± 2 K |
Ambient diffraction temperature | 100 ± 2 K |
Number of distinct elements | 6 |
Space group number | 2 |
Hermann-Mauguin space group symbol | P -1 |
Hall space group symbol | -P 1 |
Residual factor for all reflections | 0.0369 |
Residual factor for significantly intense reflections | 0.0317 |
Weighted residual factors for significantly intense reflections | 0.0792 |
Weighted residual factors for all reflections included in the refinement | 0.0839 |
Goodness-of-fit parameter for all reflections included in the refinement | 0.947 |
Diffraction radiation wavelength | 1.54178 Å |
Diffraction radiation type | CuKα |