Information card for entry 4505314
Formula | C7 H10 N2 O2 |
Calculated formula | C7 H10 N2 O2 |
SMILES | C12C(=O)NC(NC1=O)(CC2)C |
Title of publication | A Systematic Study of the Relationship between Molecular and Crystal Structure among 3,5-Diazabicyclo[2.2.2]octane-2,6-diones |
Authors of publication | Brewer, Jason T.; Parkin, Sean; Grossman, Robert B. |
Journal of publication | Crystal Growth & Design |
Year of publication | 2004 |
Journal volume | 4 |
Journal issue | 3 |
Pages of publication | 591 |
a | 9.7 ± 0.0003 Å |
b | 7.43 ± 0.0002 Å |
c | 9.909 ± 0.0004 Å |
α | 90° |
β | 94.565 ± 0.0013° |
γ | 90° |
Cell volume | 711.89 ± 0.04 Å3 |
Cell temperature | 90 ± 0.2 K |
Ambient diffraction temperature | 90 ± 0.2 K |
Number of distinct elements | 4 |
Space group number | 14 |
Hermann-Mauguin space group symbol | P 1 21/c 1 |
Hall space group symbol | -P 2ybc |
Residual factor for all reflections | 0.0508 |
Residual factor for significantly intense reflections | 0.0402 |
Weighted residual factors for significantly intense reflections | 0.1064 |
Weighted residual factors for all reflections included in the refinement | 0.1134 |
Goodness-of-fit parameter for all reflections included in the refinement | 1.045 |
Diffraction radiation wavelength | 0.71073 Å |
Diffraction radiation type | MoKα |