Information card for entry 4505320
Formula | C21 H29 Cu F3 N3 O4 |
Calculated formula | C21 H29 Cu F3 N3 O4 |
Title of publication | 1-D Coordination Polymers Made of Asymmetrical Copper Nitroxide Bis-Chelates |
Authors of publication | Burdukov, Alexei B.; Gladkikh, Ella A.; Nefedova, Ekaterina V.; Tronin, Andrei V.; Roshchupkina, Galina I.; Pervukhina, Natalie V.; Shvedenkov, Yuri G.; Reznikov, Vladimir A. |
Journal of publication | Crystal Growth & Design |
Year of publication | 2004 |
Journal volume | 4 |
Journal issue | 3 |
Pages of publication | 595 |
a | 24.813 ± 0.003 Å |
b | 10.982 ± 0.001 Å |
c | 19.813 ± 0.003 Å |
α | 90° |
β | 109.88 ± 0.01° |
γ | 90° |
Cell volume | 5077.2 ± 1.1 Å3 |
Cell temperature | 293 ± 2 K |
Ambient diffraction temperature | 293 ± 2 K |
Number of distinct elements | 6 |
Space group number | 15 |
Hermann-Mauguin space group symbol | C 1 2/c 1 |
Hall space group symbol | -C 2yc |
Residual factor for all reflections | 0.0827 |
Residual factor for significantly intense reflections | 0.0526 |
Weighted residual factors for significantly intense reflections | 0.1242 |
Weighted residual factors for all reflections included in the refinement | 0.1338 |
Goodness-of-fit parameter for all reflections included in the refinement | 0.844 |
Diffraction radiation wavelength | 0.71069 Å |
Diffraction radiation type | MoKα |