Information card for entry 4505354
Chemical name | Methyltriphenylphosphonium tris(dicyanamido)cobaltate(II) |
Formula | C25 H18 Co N9 P |
Calculated formula | C25 H18 Co N9 P |
Title of publication | Structure and Magnetism of 3D Anionic Metal Dicyanamide (MePh3P)[M(dca)3] (M = Fe, Co, Ni) and (EtPh3P)[M(dca)3] (M = Mn, Co, Ni) Networks |
Authors of publication | van der Werff, Patricia M.; Batten, Stuart R.; Jensen, Paul; Moubaraki, Boujemaa; Murray, Keith S.; Cashion, John D. |
Journal of publication | Crystal Growth & Design |
Year of publication | 2004 |
Journal volume | 4 |
Journal issue | 3 |
Pages of publication | 503 |
a | 13.8718 ± 0.0002 Å |
b | 16.9489 ± 0.0002 Å |
c | 20.772 ± 0.0003 Å |
α | 90° |
β | 90° |
γ | 90° |
Cell volume | 4883.74 ± 0.12 Å3 |
Cell temperature | 123 ± 2 K |
Ambient diffraction temperature | 123 ± 2 K |
Number of distinct elements | 5 |
Space group number | 19 |
Hermann-Mauguin space group symbol | P 21 21 21 |
Hall space group symbol | P 2ac 2ab |
Residual factor for all reflections | 0.0658 |
Residual factor for significantly intense reflections | 0.0387 |
Weighted residual factors for significantly intense reflections | 0.0609 |
Weighted residual factors for all reflections included in the refinement | 0.067 |
Goodness-of-fit parameter for all reflections included in the refinement | 1.023 |
Diffraction radiation wavelength | 0.71073 Å |
Diffraction radiation type | MoKα |