Information card for entry 4505358
Chemical name | Ethyltriphenylphosphonium tris(dicyanamido)nickelate(II) |
Formula | C26 H20 N9 Ni P |
Calculated formula | C26 H20 N9 Ni P |
Title of publication | Structure and Magnetism of 3D Anionic Metal Dicyanamide (MePh3P)[M(dca)3] (M = Fe, Co, Ni) and (EtPh3P)[M(dca)3] (M = Mn, Co, Ni) Networks |
Authors of publication | van der Werff, Patricia M.; Batten, Stuart R.; Jensen, Paul; Moubaraki, Boujemaa; Murray, Keith S.; Cashion, John D. |
Journal of publication | Crystal Growth & Design |
Year of publication | 2004 |
Journal volume | 4 |
Journal issue | 3 |
Pages of publication | 503 |
a | 14.1192 ± 0.0001 Å |
b | 16.6545 ± 0.0001 Å |
c | 21.5833 ± 0.0002 Å |
α | 90° |
β | 90° |
γ | 90° |
Cell volume | 5075.27 ± 0.07 Å3 |
Cell temperature | 123 ± 2 K |
Ambient diffraction temperature | 123 ± 2 K |
Number of distinct elements | 5 |
Space group number | 19 |
Hermann-Mauguin space group symbol | P 21 21 21 |
Hall space group symbol | P 2ac 2ab |
Residual factor for all reflections | 0.0672 |
Residual factor for significantly intense reflections | 0.0446 |
Weighted residual factors for significantly intense reflections | 0.0636 |
Weighted residual factors for all reflections included in the refinement | 0.0685 |
Goodness-of-fit parameter for all reflections included in the refinement | 1.021 |
Diffraction radiation wavelength | 0.71073 Å |
Diffraction radiation type | MoKα |