Information card for entry 4505837
Chemical name | (±)-N-(2-Chlorobenzoyl)-?-methylbenzylamine, (±)-1 |
Formula | C15 H14 Cl N O |
Calculated formula | C15 H14 Cl N O |
Title of publication | Structural Studies of Enantiomers, Racemates, and Quasiracemates. N-(2-Chlorobenzoyl)methylbenzylamine and N-(2-Bromobenzoyl)methylbenzylamine |
Authors of publication | Fomulu, Shella L.; Hendi, Mukta S.; Davis, Raymond E.; Wheeler, Kraig A. |
Journal of publication | Crystal Growth & Design |
Year of publication | 2002 |
Journal volume | 2 |
Journal issue | 6 |
Pages of publication | 645 |
a | 8.7493 ± 0.0005 Å |
b | 17.6087 ± 0.0011 Å |
c | 9.4563 ± 0.0006 Å |
α | 90° |
β | 108.697 ± 0.005° |
γ | 90° |
Cell volume | 1379.99 ± 0.15 Å3 |
Cell temperature | 293 ± 2 K |
Ambient diffraction temperature | 293 ± 2 K |
Number of distinct elements | 5 |
Space group number | 14 |
Hermann-Mauguin space group symbol | P 1 21/c 1 |
Hall space group symbol | -P 2ybc |
Residual factor for all reflections | 0.1283 |
Residual factor for significantly intense reflections | 0.0601 |
Weighted residual factors for significantly intense reflections | 0.1288 |
Weighted residual factors for all reflections included in the refinement | 0.1562 |
Goodness-of-fit parameter for all reflections included in the refinement | 1.039 |
Diffraction radiation wavelength | 0.71073 Å |
Diffraction radiation type | MoKα |