Information card for entry 4507981
Formula | C11 H11 O2 |
Calculated formula | C11 H11 O2 |
Title of publication | Preparative Resolution of (±)-Bis-tetralone by Means of Autoseeded Preferential Crystallization Induced by Solvent Evaporation (ASPreCISE) |
Authors of publication | Mahieux, J.; Sanselme, M.; Harthong, S.; Melan, C.; Aronica, C.; Guy, L.; Coquerel, G. |
Journal of publication | Crystal Growth & Design |
Year of publication | 2013 |
Journal volume | 13 |
Journal issue | 8 |
Pages of publication | 3621 |
a | 8.3066 ± 0.0015 Å |
b | 8.3066 ± 0.0015 Å |
c | 25.829 ± 0.005 Å |
α | 90° |
β | 90° |
γ | 90° |
Cell volume | 1782.2 ± 0.6 Å3 |
Cell temperature | 293 ± 2 K |
Ambient diffraction temperature | 293 ± 2 K |
Number of distinct elements | 3 |
Space group number | 96 |
Hermann-Mauguin space group symbol | P 43 21 2 |
Hall space group symbol | P 4nw 2abw |
Residual factor for all reflections | 0.0429 |
Residual factor for significantly intense reflections | 0.0408 |
Weighted residual factors for significantly intense reflections | 0.1138 |
Weighted residual factors for all reflections included in the refinement | 0.1163 |
Goodness-of-fit parameter for all reflections included in the refinement | 1.064 |
Diffraction radiation probe | x-ray |
Diffraction radiation wavelength | 0.71073 Å |
Diffraction radiation type | MoKα |