Information card for entry 4508872
Chemical name | 9-(4-methoxyphenyl)-9H-xanthen-9-ol anthracene clathrate |
Formula | C27 H21 O3 |
Calculated formula | C27 H21 O3 |
Title of publication | Xanthenol Clathrates: Structures and Solid−Solid Reactions |
Authors of publication | Curtis, Elizabeth; Nassimbeni, Luigi R.; Su, Hong; Taljaard, Jana H. |
Journal of publication | Crystal Growth & Design |
Year of publication | 2006 |
Journal volume | 6 |
Journal issue | 12 |
Pages of publication | 2716 |
a | 8.3447 ± 0.0002 Å |
b | 9.2247 ± 0.0003 Å |
c | 13.3533 ± 0.0004 Å |
α | 91.857 ± 0.002° |
β | 92.303 ± 0.002° |
γ | 108.133 ± 0.001° |
Cell volume | 974.97 ± 0.05 Å3 |
Cell temperature | 113 ± 2 K |
Ambient diffraction temperature | 113 ± 2 K |
Number of distinct elements | 3 |
Space group number | 2 |
Hermann-Mauguin space group symbol | P -1 |
Hall space group symbol | -P 1 |
Residual factor for all reflections | 0.0821 |
Residual factor for significantly intense reflections | 0.0451 |
Weighted residual factors for significantly intense reflections | 0.1018 |
Weighted residual factors for all reflections included in the refinement | 0.1154 |
Goodness-of-fit parameter for all reflections included in the refinement | 1.023 |
Diffraction radiation wavelength | 0.71073 Å |
Diffraction radiation type | MoKα |