Information card for entry 4508888
Formula | C34 H54 Cd2 N12 O17 |
Calculated formula | C34 H54 Cd2 N12 O17 |
Title of publication | Encapsulation of Water Cluster,meso-Helical Chain and Tapes in Metal−Organic Frameworks Based on Double-Stranded Cd(II) Helicates and Carboxylates |
Authors of publication | Cheng, Lin; Lin, Jian-Bin; Gong, Jun-Zhou; Sun, Ai-Ping; Ye, Bao-Hui; Chen, Xiao-Ming |
Journal of publication | Crystal Growth & Design |
Year of publication | 2006 |
Journal volume | 6 |
Journal issue | 12 |
Pages of publication | 2739 |
a | 20.985 ± 0.003 Å |
b | 14.837 ± 0.002 Å |
c | 14.941 ± 0.002 Å |
α | 90° |
β | 92.09 ± 0.003° |
γ | 90° |
Cell volume | 4648.9 ± 1.1 Å3 |
Cell temperature | 100 ± 2 K |
Ambient diffraction temperature | 100 ± 2 K |
Number of distinct elements | 5 |
Space group number | 15 |
Hermann-Mauguin space group symbol | C 1 2/c 1 |
Hall space group symbol | -C 2yc |
Residual factor for all reflections | 0.0677 |
Residual factor for significantly intense reflections | 0.0534 |
Weighted residual factors for significantly intense reflections | 0.1292 |
Weighted residual factors for all reflections included in the refinement | 0.1396 |
Goodness-of-fit parameter for all reflections included in the refinement | 1.023 |
Diffraction radiation wavelength | 0.71073 Å |
Diffraction radiation type | MoKα |