Information card for entry 4508893
Formula | C10 H11 Cl F2 O2 S |
Calculated formula | C10 H11 Cl0.971 F1.942 O2 S |
Title of publication | The Role of Organic Fluorine in the Supramolecular Assembly of Halogenated β-Hydroxysulphoxides Diastereomers |
Authors of publication | Asensio, Gregorio; Medio-Simon, Mercedes; Alemán, Pedro; de Arellano, Carmen Ramírez |
Journal of publication | Crystal Growth & Design |
Year of publication | 2006 |
Journal volume | 6 |
Journal issue | 12 |
Pages of publication | 2769 |
a | 9.1588 ± 0.0017 Å |
b | 5.7511 ± 0.0013 Å |
c | 12.097 ± 0.002 Å |
α | 90° |
β | 103.858 ± 0.015° |
γ | 90° |
Cell volume | 618.6 ± 0.2 Å3 |
Cell temperature | 291 ± 2 K |
Ambient diffraction temperature | 291 ± 2 K |
Number of distinct elements | 6 |
Space group number | 4 |
Hermann-Mauguin space group symbol | P 1 21 1 |
Hall space group symbol | P 2yb |
Residual factor for all reflections | 0.083 |
Residual factor for significantly intense reflections | 0.0623 |
Weighted residual factors for significantly intense reflections | 0.1957 |
Weighted residual factors for all reflections included in the refinement | 0.2112 |
Goodness-of-fit parameter for all reflections included in the refinement | 1.062 |
Diffraction radiation wavelength | 0.71073 Å |
Diffraction radiation type | MoKα |