Information card for entry 4509135
Formula | C4 H10 Cd5 N20 O10 S2 |
Calculated formula | C4 H8 Cd5 N20 O10 S2 |
Title of publication | Syntheses, Structures, and Characterizations of Two Pairs of Cd(II)-5-Aminotetrazolate Coordination Polymers |
Authors of publication | Yao, Ya-Li; Xue, Lin; Che, Yun-Xia; Zheng, Ji-Min |
Journal of publication | Crystal Growth & Design |
Year of publication | 2009 |
Journal volume | 9 |
Journal issue | 1 |
Pages of publication | 606 |
a | 8.8482 ± 0.0018 Å |
b | 9.5706 ± 0.0019 Å |
c | 13.312 ± 0.003 Å |
α | 90° |
β | 102.43 ± 0.03° |
γ | 90° |
Cell volume | 1100.9 ± 0.4 Å3 |
Cell temperature | 298 ± 2 K |
Ambient diffraction temperature | 298 ± 2 K |
Number of distinct elements | 6 |
Space group number | 14 |
Hermann-Mauguin space group symbol | P 1 21/c 1 |
Hall space group symbol | -P 2ybc |
Residual factor for all reflections | 0.0297 |
Residual factor for significantly intense reflections | 0.0248 |
Weighted residual factors for significantly intense reflections | 0.053 |
Weighted residual factors for all reflections included in the refinement | 0.0716 |
Goodness-of-fit parameter for all reflections included in the refinement | 1.202 |
Diffraction radiation probe | x-ray |
Diffraction radiation wavelength | 0.71073 Å |
Diffraction radiation type | MoKα |