Information card for entry 4510599
Formula | Bi Cl O3 Se |
Calculated formula | Bi Cl O3 Se |
Title of publication | Revised Bismuth Chloroselenite System: Evidence of a Noncentrosymmmetric Structure with a Giant Unit Cell |
Authors of publication | Aliev, Almaz; Kovrugin, V. M.; Colmont, Marie; Terryn, Christine; Huvé, Marielle; Siidra, O. I.; Krivovichev, S. V.; Mentré, Olivier |
Journal of publication | Crystal Growth & Design |
Year of publication | 2014 |
Journal volume | 14 |
Journal issue | 6 |
Pages of publication | 3026 |
a | 22.7052 ± 0.0003 Å |
b | 76.785 ± 0.004 Å |
c | 16.055 ± 0.0003 Å |
α | 90° |
β | 135 ± 0.0017° |
γ | 90° |
Cell volume | 19792.3 ± 1.3 Å3 |
Cell temperature | 293 K |
Ambient diffraction temperature | 293 K |
Number of distinct elements | 4 |
Space group number | 9 |
Hermann-Mauguin space group symbol | C 1 c 1 |
Hall space group symbol | C -2yc |
Residual factor for all reflections | 0.1124 |
Residual factor for significantly intense reflections | 0.0612 |
Weighted residual factors for significantly intense reflections | 0.0645 |
Weighted residual factors for all reflections included in the refinement | 0.0694 |
Goodness-of-fit parameter for significantly intense reflections | 1.63 |
Goodness-of-fit parameter for all reflections included in the refinement | 1.32 |
Diffraction radiation probe | x-ray |
Diffraction radiation wavelength | 0.71073 Å |
Diffraction radiation type | MoKα |