Information card for entry 4510862
Formula | C26 H42 K N2 O10 Os |
Calculated formula | C26 H42 K N2 O10 Os |
Title of publication | Os(VI)O2/K Metal‒Organic Frameworks: Infinite Chain, Grid, and Porous Networks |
Authors of publication | Eckshtain-Levi, Meital; Yufit, Dmitry; Shimon, Linda J. W.; Kirillov, Alexander M.; Benisvy, Laurent |
Journal of publication | Crystal Growth & Design |
Year of publication | 2014 |
Journal volume | 14 |
Journal issue | 6 |
Pages of publication | 2703 |
a | 6.6601 ± 0.00014 Å |
b | 17.5692 ± 0.0003 Å |
c | 26.7739 ± 0.0006 Å |
α | 90° |
β | 91.926 ± 0.0019° |
γ | 90° |
Cell volume | 3131.11 ± 0.11 Å3 |
Cell temperature | 120 K |
Ambient diffraction temperature | 120 K |
Number of distinct elements | 6 |
Space group number | 14 |
Hermann-Mauguin space group symbol | P 1 21/c 1 |
Hall space group symbol | -P 2ybc |
Residual factor for all reflections | 0.0454 |
Residual factor for significantly intense reflections | 0.0421 |
Weighted residual factors for significantly intense reflections | 0.0927 |
Weighted residual factors for all reflections included in the refinement | 0.094 |
Goodness-of-fit parameter for all reflections included in the refinement | 1.181 |
Diffraction radiation wavelength | 0.7107 Å |
Diffraction radiation type | MoKα |
Diffraction radiation X-ray symbol | Mo |