Information card for entry 4510905
Formula | C30 H16 O4 |
Calculated formula | C30 H16 O4 |
SMILES | O=C(OC)c1cc2C#CC#Cc3c(C#Cc4c(C#Cc2cc1)cccc4)ccc(c3)C(=O)OC |
Title of publication | Polymorphism of Dehydrobenzo[14]annulene Possessing Two Methyl Ester Groups in Noncentrosymmetric Positions |
Authors of publication | Hisaki, Ichiro; Kometani, Eriko; Shigemitsu, Hajime; Saeki, Akinori; Seki, Shu; Tohnai, Norimitsu; Miyata, Mikiji |
Journal of publication | Crystal Growth & Design |
Year of publication | 2011 |
Journal volume | 11 |
Journal issue | 12 |
Pages of publication | 5488 - 5497 |
a | 9.88125 ± 0.00018 Å |
b | 10.12115 ± 0.00018 Å |
c | 22.1855 ± 0.0004 Å |
α | 95.305 ± 0.0009° |
β | 93.75 ± 0.0009° |
γ | 91.771 ± 0.001° |
Cell volume | 2203 ± 0.07 Å3 |
Cell temperature | 213.1 K |
Ambient diffraction temperature | 213 K |
Number of distinct elements | 3 |
Space group number | 2 |
Hermann-Mauguin space group symbol | P -1 |
Hall space group symbol | -P 1 |
Residual factor for significantly intense reflections | 0.0654 |
Weighted residual factors for all reflections included in the refinement | 0.1578 |
Goodness-of-fit parameter for all reflections included in the refinement | 0.848 |
Diffraction radiation wavelength | 1.54187 Å |
Diffraction radiation type | CuKα |
Duplicate of | 4501319 |