Information card for entry 4511305
Formula | C20 H18 N2 O2 S |
Calculated formula | C20 H18 N2 O2 S |
SMILES | S(=O)(=O)(NN=C(c1ccccc1)c1ccccc1)c1ccc(cc1)C |
Title of publication | Kinetic and Thermodynamic Conformational Polymorphs of Bis(p-tolyl) Ketonep-Tosylhydrazone: The Curtin−Hammett Principle in Crystallization |
Authors of publication | Roy, Saikat; Nangia, Ashwini |
Journal of publication | Crystal Growth & Design |
Year of publication | 2007 |
Journal volume | 7 |
Journal issue | 10 |
Pages of publication | 2047 |
a | 9.8402 ± 0.0016 Å |
b | 10.1297 ± 0.0016 Å |
c | 10.5669 ± 0.0017 Å |
α | 117.517 ± 0.002° |
β | 95.8 ± 0.002° |
γ | 99.945 ± 0.002° |
Cell volume | 900.2 ± 0.3 Å3 |
Cell temperature | 298 ± 2 K |
Ambient diffraction temperature | 298 ± 2 K |
Number of distinct elements | 5 |
Space group number | 2 |
Hermann-Mauguin space group symbol | P -1 |
Hall space group symbol | -P 1 |
Residual factor for all reflections | 0.0617 |
Residual factor for significantly intense reflections | 0.0524 |
Weighted residual factors for significantly intense reflections | 0.132 |
Weighted residual factors for all reflections included in the refinement | 0.1392 |
Goodness-of-fit parameter for all reflections included in the refinement | 1.03 |
Diffraction radiation wavelength | 0.71073 Å |
Diffraction radiation type | MoKα |