Information card for entry 4514367
Formula | C150 H164 Ag8 F9 N53 O25 S12 |
Calculated formula | C149.88 H159.78 Ag8 F9 N52.98 O24.99 S12 |
Title of publication | Silver Clusters as Robust Nodes and π‒Activation Sites for the Construction of Heterogeneous Catalysts for the Cycloaddition of Propargylamines |
Authors of publication | Chang, Zhiduo; Jing, Xu; He, Cheng; Liu, Xin; Duan, Chunying |
Journal of publication | ACS Catalysis |
Year of publication | 2018 |
Journal volume | 8 |
Journal issue | 2 |
Pages of publication | 1384 |
a | 35.191 ± 0.0008 Å |
b | 35.191 ± 0.0008 Å |
c | 35.191 ± 0.0008 Å |
α | 90° |
β | 90° |
γ | 90° |
Cell volume | 43580.8 ± 1.7 Å3 |
Cell temperature | 165 ± 2 K |
Ambient diffraction temperature | 165 ± 2 K |
Number of distinct elements | 7 |
Space group number | 198 |
Hermann-Mauguin space group symbol | P 21 3 |
Hall space group symbol | P 2ac 2ab 3 |
Residual factor for all reflections | 0.2886 |
Residual factor for significantly intense reflections | 0.0984 |
Weighted residual factors for significantly intense reflections | 0.2199 |
Weighted residual factors for all reflections included in the refinement | 0.2477 |
Goodness-of-fit parameter for all reflections included in the refinement | 1.001 |
Diffraction radiation wavelength | 0.71073 Å |
Diffraction radiation type | MoKα |