Information card for entry 4514534
Formula | C73 H65 Br4 Cl3 N4 Pt2 Si4 |
Calculated formula | C73 H64 Br4 Cl3 N4 Pt2 Si4 |
Title of publication | Facile and Equipment-Free Data Encryption and Decryption by Self-Encrypting Pt(II) Complex. |
Authors of publication | Kang, Jiajia; Ni, Jun; Su, Mengmeng; Li, Yanqin; Zhang, Jianjun; Zhou, Huajun; Chen, Zhong-Ning |
Journal of publication | ACS applied materials & interfaces |
Year of publication | 2019 |
Journal volume | 11 |
Journal issue | 14 |
Pages of publication | 13350 - 13358 |
a | 13.744 ± 0.0004 Å |
b | 14.0426 ± 0.0004 Å |
c | 19.9366 ± 0.0006 Å |
α | 98.91 ± 0.002° |
β | 91.715 ± 0.002° |
γ | 98.739 ± 0.002° |
Cell volume | 3751.6 ± 0.19 Å3 |
Cell temperature | 210 ± 2 K |
Ambient diffraction temperature | 210 ± 2 K |
Number of distinct elements | 7 |
Space group number | 2 |
Hermann-Mauguin space group symbol | P -1 |
Hall space group symbol | -P 1 |
Residual factor for all reflections | 0.06 |
Residual factor for significantly intense reflections | 0.0396 |
Weighted residual factors for significantly intense reflections | 0.0819 |
Weighted residual factors for all reflections included in the refinement | 0.09 |
Goodness-of-fit parameter for all reflections included in the refinement | 1.014 |
Diffraction radiation wavelength | 0.71073 Å |
Diffraction radiation type | MoKα |