Information card for entry 4514641
Formula | C50 H60 N4 O4 Rh2 |
Calculated formula | C50 H60 N4 O4 Rh2 |
Title of publication | Mechanistic Studies of Single-Step Styrene Production Catalyzed by Rh Complexes with Diimine Ligands: An Evaluation of the Role of Ligands and Induction Period |
Authors of publication | Zhu, Weihao; Luo, Zhongwen; Chen, Junqi; Liu, Chang; Yang, Lu; Dickie, Diane A.; Liu, Naiming; Zhang, Sen; Davis, Robert J.; Gunnoe, T. Brent |
Journal of publication | ACS Catalysis |
Year of publication | 2019 |
Journal volume | 9 |
Journal issue | 8 |
Pages of publication | 7457 |
a | 19.9451 ± 0.0016 Å |
b | 11.5613 ± 0.001 Å |
c | 20.0794 ± 0.0015 Å |
α | 90° |
β | 94.241 ± 0.002° |
γ | 90° |
Cell volume | 4617.5 ± 0.6 Å3 |
Cell temperature | 100 ± 2 K |
Ambient diffraction temperature | 100 ± 2 K |
Number of distinct elements | 5 |
Space group number | 14 |
Hermann-Mauguin space group symbol | P 1 21/c 1 |
Hall space group symbol | -P 2ybc |
Residual factor for all reflections | 0.1007 |
Residual factor for significantly intense reflections | 0.0431 |
Weighted residual factors for significantly intense reflections | 0.0847 |
Weighted residual factors for all reflections included in the refinement | 0.1019 |
Goodness-of-fit parameter for all reflections included in the refinement | 1.006 |
Diffraction radiation wavelength | 0.71073 Å |
Diffraction radiation type | MoKα |