Information card for entry 4515513
Formula | C25 H27 Br N2 O2 |
Calculated formula | C25 H27 Br N2 O2 |
Title of publication | Enantioselective Addition of Cyclic Ketones to Unactivated Alkenes Enabled by Amine/Pd(II) Cooperative Catalysis |
Authors of publication | Shen, Hong-Cheng; Zhang, Ling; Chen, Shu-Sen; Feng, Jiajie; Zhang, Bo-Wen; Zhang, Ying; Zhang, Xinhao; Wu, Yun-Dong; Gong, Liu-Zhu |
Journal of publication | ACS Catalysis |
Year of publication | 2018 |
Journal volume | 9 |
Journal issue | 2 |
Pages of publication | 791 |
a | 9.0909 ± 0.0003 Å |
b | 13.2501 ± 0.0004 Å |
c | 36.0908 ± 0.0012 Å |
α | 90° |
β | 90° |
γ | 90° |
Cell volume | 4347.3 ± 0.2 Å3 |
Cell temperature | 173 ± 2 K |
Ambient diffraction temperature | 173 K |
Number of distinct elements | 5 |
Space group number | 19 |
Hermann-Mauguin space group symbol | P 21 21 21 |
Hall space group symbol | P 2ac 2ab |
Residual factor for all reflections | 0.0646 |
Residual factor for significantly intense reflections | 0.0468 |
Weighted residual factors for significantly intense reflections | 0.1017 |
Weighted residual factors for all reflections included in the refinement | 0.1124 |
Goodness-of-fit parameter for all reflections included in the refinement | 1.043 |
Diffraction radiation wavelength | 1.34139 Å |
Diffraction radiation type | GaKα |