Information card for entry 4515517
Formula | C45 H36 K Mn N7 O3 |
Calculated formula | C45 H36 K Mn N7 O3 |
Title of publication | Comparative Nitrene-Transfer Chemistry to Olefinic Substrates Mediated by a Library of Anionic Mn(II) Triphenylamido-Amine Reagents and M(II) Congeners (M = Fe, Co, Ni) Favoring Aromatic over Aliphatic Alkenes |
Authors of publication | Bagchi, Vivek; Kalra, Anshika; Das, Purak; Paraskevopoulou, Patrina; Gorla, Saidulu; Ai, Lin; Wang, Qiuwen; Mohapatra, Sudip; Choudhury, Amitava; Sun, Zhicheng; Cundari, Thomas R.; Stavropoulos, Pericles |
Journal of publication | ACS Catalysis |
Year of publication | 2018 |
Journal volume | 8 |
Journal issue | 10 |
Pages of publication | 9183 |
a | 11.7651 ± 0.0007 Å |
b | 21.2221 ± 0.0012 Å |
c | 16.4682 ± 0.0009 Å |
α | 90° |
β | 95.468 ± 0.001° |
γ | 90° |
Cell volume | 4093.1 ± 0.4 Å3 |
Cell temperature | 137 ± 2 K |
Ambient diffraction temperature | 137 ± 2 K |
Number of distinct elements | 6 |
Space group number | 14 |
Hermann-Mauguin space group symbol | P 1 21/n 1 |
Hall space group symbol | -P 2yn |
Residual factor for all reflections | 0.0558 |
Residual factor for significantly intense reflections | 0.0436 |
Weighted residual factors for significantly intense reflections | 0.1096 |
Weighted residual factors for all reflections included in the refinement | 0.1162 |
Goodness-of-fit parameter for all reflections included in the refinement | 1.064 |
Diffraction radiation wavelength | 0.71073 Å |
Diffraction radiation type | MoKα |