Information card for entry 4515520
Formula | C53 H47.5 F9 K Mn N4.5 O6.5 |
Calculated formula | C53 H47.5 F9 K Mn N4.5 O6.5 |
Title of publication | Comparative Nitrene-Transfer Chemistry to Olefinic Substrates Mediated by a Library of Anionic Mn(II) Triphenylamido-Amine Reagents and M(II) Congeners (M = Fe, Co, Ni) Favoring Aromatic over Aliphatic Alkenes |
Authors of publication | Bagchi, Vivek; Kalra, Anshika; Das, Purak; Paraskevopoulou, Patrina; Gorla, Saidulu; Ai, Lin; Wang, Qiuwen; Mohapatra, Sudip; Choudhury, Amitava; Sun, Zhicheng; Cundari, Thomas R.; Stavropoulos, Pericles |
Journal of publication | ACS Catalysis |
Year of publication | 2018 |
Journal volume | 8 |
Journal issue | 10 |
Pages of publication | 9183 |
a | 12.3883 ± 0.0015 Å |
b | 18.995 ± 0.002 Å |
c | 21.656 ± 0.003 Å |
α | 90° |
β | 101.457 ± 0.002° |
γ | 90° |
Cell volume | 4994.5 ± 1.1 Å3 |
Cell temperature | 137 ± 2 K |
Ambient diffraction temperature | 137 ± 2 K |
Number of distinct elements | 7 |
Space group number | 14 |
Hermann-Mauguin space group symbol | P 1 21/n 1 |
Hall space group symbol | -P 2yn |
Residual factor for all reflections | 0.1737 |
Residual factor for significantly intense reflections | 0.0917 |
Weighted residual factors for significantly intense reflections | 0.1762 |
Weighted residual factors for all reflections included in the refinement | 0.2119 |
Goodness-of-fit parameter for all reflections included in the refinement | 1.028 |
Diffraction radiation wavelength | 0.71073 Å |
Diffraction radiation type | MoKα |