Information card for entry 4515522
Formula | C88 H131 K Mn N4 O7 |
Calculated formula | C88 H131 K Mn N4 O7 |
Title of publication | Comparative Nitrene-Transfer Chemistry to Olefinic Substrates Mediated by a Library of Anionic Mn(II) Triphenylamido-Amine Reagents and M(II) Congeners (M = Fe, Co, Ni) Favoring Aromatic over Aliphatic Alkenes |
Authors of publication | Bagchi, Vivek; Kalra, Anshika; Das, Purak; Paraskevopoulou, Patrina; Gorla, Saidulu; Ai, Lin; Wang, Qiuwen; Mohapatra, Sudip; Choudhury, Amitava; Sun, Zhicheng; Cundari, Thomas R.; Stavropoulos, Pericles |
Journal of publication | ACS Catalysis |
Year of publication | 2018 |
Journal volume | 8 |
Journal issue | 10 |
Pages of publication | 9183 |
a | 13.4244 ± 0.0015 Å |
b | 15.4608 ± 0.0017 Å |
c | 21.041 ± 0.002 Å |
α | 92.203 ± 0.002° |
β | 93.474 ± 0.001° |
γ | 102.805 ± 0.001° |
Cell volume | 4244.6 ± 0.8 Å3 |
Cell temperature | 130 ± 2 K |
Ambient diffraction temperature | 130 ± 2 K |
Number of distinct elements | 6 |
Space group number | 2 |
Hermann-Mauguin space group symbol | P -1 |
Hall space group symbol | -P 1 |
Residual factor for all reflections | 0.1006 |
Residual factor for significantly intense reflections | 0.0823 |
Weighted residual factors for significantly intense reflections | 0.2295 |
Weighted residual factors for all reflections included in the refinement | 0.248 |
Goodness-of-fit parameter for all reflections included in the refinement | 1.014 |
Diffraction radiation wavelength | 0.71073 Å |
Diffraction radiation type | MoKα |