Information card for entry 4515532
Formula | C36 H39 F9 K N7 Ni O6 |
Calculated formula | C36 H39 F9 K N7 Ni O6 |
Title of publication | Comparative Nitrene-Transfer Chemistry to Olefinic Substrates Mediated by a Library of Anionic Mn(II) Triphenylamido-Amine Reagents and M(II) Congeners (M = Fe, Co, Ni) Favoring Aromatic over Aliphatic Alkenes |
Authors of publication | Bagchi, Vivek; Kalra, Anshika; Das, Purak; Paraskevopoulou, Patrina; Gorla, Saidulu; Ai, Lin; Wang, Qiuwen; Mohapatra, Sudip; Choudhury, Amitava; Sun, Zhicheng; Cundari, Thomas R.; Stavropoulos, Pericles |
Journal of publication | ACS Catalysis |
Year of publication | 2018 |
Journal volume | 8 |
Journal issue | 10 |
Pages of publication | 9183 |
a | 9.133 ± 0.008 Å |
b | 29.15 ± 0.03 Å |
c | 16.125 ± 0.014 Å |
α | 90° |
β | 95.392 ± 0.012° |
γ | 90° |
Cell volume | 4274 ± 7 Å3 |
Cell temperature | 220 ± 2 K |
Ambient diffraction temperature | 220 ± 2 K |
Number of distinct elements | 7 |
Space group number | 14 |
Hermann-Mauguin space group symbol | P 1 21/n 1 |
Hall space group symbol | -P 2yn |
Residual factor for all reflections | 0.0805 |
Residual factor for significantly intense reflections | 0.0564 |
Weighted residual factors for significantly intense reflections | 0.1475 |
Weighted residual factors for all reflections included in the refinement | 0.1648 |
Goodness-of-fit parameter for all reflections included in the refinement | 1.024 |
Diffraction radiation wavelength | 0.71073 Å |
Diffraction radiation type | MoKα |