Information card for entry 4515571
Formula | C49 H66 Ce2 N11 O17 |
Calculated formula | C49 H66 Ce2 N11 O17 |
Title of publication | Oxidation of Alcohols to Carbonyl Compounds Catalyzed by Oxo-Bridged Dinuclear Cerium Complexes with Pentadentate Schiff-Base Ligands under a Dioxygen Atmosphere |
Authors of publication | Shirase, Satoru; Shinohara, Koichi; Tsurugi, Hayato; Mashima, Kazushi |
Journal of publication | ACS Catalysis |
Year of publication | 2018 |
Journal volume | 8 |
Journal issue | 8 |
Pages of publication | 6939 |
a | 22.935 ± 0.003 Å |
b | 19.6202 ± 0.0017 Å |
c | 13.5095 ± 0.0014 Å |
α | 90° |
β | 114.142 ± 0.002° |
γ | 90° |
Cell volume | 5547.4 ± 1 Å3 |
Cell temperature | 113 K |
Ambient diffraction temperature | 113 K |
Number of distinct elements | 5 |
Space group number | 15 |
Hermann-Mauguin space group symbol | C 1 2/c 1 |
Hall space group symbol | -C 2yc |
Residual factor for all reflections | 0.0319 |
Residual factor for significantly intense reflections | 0.026 |
Weighted residual factors for significantly intense reflections | 0.0656 |
Weighted residual factors for all reflections included in the refinement | 0.0676 |
Goodness-of-fit parameter for all reflections included in the refinement | 1.034 |
Diffraction radiation wavelength | 0.71075 Å |
Diffraction radiation type | MoKα |