Information card for entry 4515598
Formula | C55 H93 N6 O4 Zn2 |
Calculated formula | C55 H93 N6 O4 Zn2 |
Title of publication | Side Arm Twist on Zn-Catalyzed Hydrosilylative Reduction of CO2 to Formate and Methanol Equivalents with High Selectivity and Activity |
Authors of publication | Feng, Guoqin; Du, Chongyang; Xiang, Li; del Rosal, Iker; Li, Guangyu; Leng, Xuebing; Chen, Eugene Y.-X.; Maron, Laurent; Chen, Yaofeng |
Journal of publication | ACS Catalysis |
Year of publication | 2018 |
Journal volume | 8 |
Journal issue | 5 |
Pages of publication | 4710 |
a | 12.7688 ± 0.0002 Å |
b | 13.881 ± 0.0003 Å |
c | 17.4955 ± 0.0003 Å |
α | 76.808 ± 0.001° |
β | 73.779 ± 0.001° |
γ | 84.324 ± 0.001° |
Cell volume | 2896.9 ± 0.09 Å3 |
Cell temperature | 170 ± 2 K |
Ambient diffraction temperature | 170 K |
Number of distinct elements | 5 |
Space group number | 2 |
Hermann-Mauguin space group symbol | P -1 |
Hall space group symbol | -P 1 |
Residual factor for all reflections | 0.0479 |
Residual factor for significantly intense reflections | 0.0434 |
Weighted residual factors for significantly intense reflections | 0.1143 |
Weighted residual factors for all reflections included in the refinement | 0.1181 |
Goodness-of-fit parameter for all reflections included in the refinement | 1.0462 |
Diffraction radiation wavelength | 1.34139 Å |
Diffraction radiation type | synchrotron |