Information card for entry 4515605
Formula | C43 H56 Cl N3 Ni |
Calculated formula | C43 H56 Cl N3 Ni |
Title of publication | Elucidating the Mechanism of Aryl Aminations Mediated by NHC-Supported Nickel Complexes: Evidence for a Nonradical Ni(0)/Ni(II) Pathway |
Authors of publication | Rull, Silvia G.; Funes-Ardoiz, Ignacio; Maya, Celia; Maseras, Feliu; Fructos, Manuel R.; Belderrain, Tomás R.; Nicasio, M. Carmen |
Journal of publication | ACS Catalysis |
Year of publication | 2018 |
Journal volume | 8 |
Journal issue | 5 |
Pages of publication | 3733 |
a | 27.4949 ± 0.0015 Å |
b | 19.0191 ± 0.0015 Å |
c | 16.9558 ± 0.0011 Å |
α | 90° |
β | 108.589 ± 0.003° |
γ | 90° |
Cell volume | 8404.1 ± 1 Å3 |
Cell temperature | 100 ± 2 K |
Ambient diffraction temperature | 100 ± 2 K |
Number of distinct elements | 5 |
Space group number | 15 |
Hermann-Mauguin space group symbol | C 1 2/c 1 |
Hall space group symbol | -C 2yc |
Residual factor for all reflections | 0.0898 |
Residual factor for significantly intense reflections | 0.073 |
Weighted residual factors for significantly intense reflections | 0.2 |
Weighted residual factors for all reflections included in the refinement | 0.2088 |
Goodness-of-fit parameter for all reflections included in the refinement | 1.472 |
Diffraction radiation wavelength | 0.56086 Å |
Diffraction radiation type | AgKα |