Information card for entry 4515728
Formula | C47 H43 Br Mn N O4 P2 |
Calculated formula | C47 H43 Br Mn N O4 P2 |
Title of publication | Synthesis of Pyrazines and Quinoxalines via Acceptorless Dehydrogenative Coupling Routes Catalyzed by Manganese Pincer Complexes. |
Authors of publication | Daw, Prosenjit; Kumar, Amit; Espinosa-Jalapa, Noel Angel; Diskin-Posner, Yael; Ben-David, Yehoshoa; Milstein, David |
Journal of publication | ACS catalysis |
Year of publication | 2018 |
Journal volume | 8 |
Journal issue | 9 |
Pages of publication | 7734 - 7741 |
a | 12.0659 ± 0.0003 Å |
b | 12.6901 ± 0.0002 Å |
c | 13.3087 ± 0.0003 Å |
α | 94.285 ± 0.001° |
β | 102.738 ± 0.002° |
γ | 90.704 ± 0.002° |
Cell volume | 1981.22 ± 0.08 Å3 |
Cell temperature | 100 ± 2 K |
Ambient diffraction temperature | 100 ± 2 K |
Number of distinct elements | 7 |
Space group number | 2 |
Hermann-Mauguin space group symbol | P -1 |
Hall space group symbol | -P 1 |
Residual factor for all reflections | 0.0643 |
Residual factor for significantly intense reflections | 0.0612 |
Weighted residual factors for significantly intense reflections | 0.161 |
Weighted residual factors for all reflections included in the refinement | 0.1637 |
Goodness-of-fit parameter for all reflections included in the refinement | 1.03 |
Diffraction radiation wavelength | 1.54184 Å |
Diffraction radiation type | CuKα |