Information card for entry 4515764
Formula |
C27 H28 Cl2 N4 O8 |
Calculated formula |
C27 H28 Cl2 N4 O8 |
Title of publication |
Synthesis of Chiral Trispirocyclic Oxindoles via Organic-Base/Au(I)-Catalyzed Sequential Reactions |
Authors of publication |
Guo, Wengang; Li, Lu; Ding, Qian; Lin, Xiangfeng; Liu, Xianghui; Wang, Kai; Liu, Yan; Fan, Hongjun; Li, Can |
Journal of publication |
ACS Catalysis |
Year of publication |
2018 |
Journal volume |
8 |
Journal issue |
11 |
Pages of publication |
10180 |
a |
12.4437 ± 0.0012 Å |
b |
15.4069 ± 0.0015 Å |
c |
15.5019 ± 0.0016 Å |
α |
90° |
β |
90° |
γ |
90° |
Cell volume |
2972 ± 0.5 Å3 |
Cell temperature |
293 ± 2 K |
Ambient diffraction temperature |
293 ± 2 K |
Number of distinct elements |
5 |
Space group number |
19 |
Hermann-Mauguin space group symbol |
P 21 21 21 |
Hall space group symbol |
P 2ac 2ab |
Residual factor for all reflections |
0.0631 |
Residual factor for significantly intense reflections |
0.0487 |
Weighted residual factors for significantly intense reflections |
0.1304 |
Weighted residual factors for all reflections included in the refinement |
0.1408 |
Goodness-of-fit parameter for all reflections included in the refinement |
1.054 |
Diffraction radiation wavelength |
0.71073 Å |
Diffraction radiation type |
MoKα |
Yes |
Yes |
No |