Information card for entry 4515784
Formula | C10 H10 Cl4 F3 N O W |
Calculated formula | C10 H10 Cl4 F3 N O W |
SMILES | [W](Cl)(Cl)(Cl)(Cl)([O]1CCCC1)=Nc1c(F)cc(F)cc1F |
Title of publication | Exploration of Homogeneous Ethylene Dimerization Mediated by Tungsten Mono(imido) Complexes |
Authors of publication | Messinis, Antonis M.; Wright, William R. H.; Batsanov, Andrei S.; Howard, Judith A. K.; Hanton, Martin J.; Dyer, Philip W. |
Journal of publication | ACS Catalysis |
Year of publication | 2018 |
Journal volume | 8 |
Journal issue | 12 |
Pages of publication | 11235 |
a | 11.3589 ± 0.0005 Å |
b | 11.3408 ± 0.0005 Å |
c | 11.9422 ± 0.0006 Å |
α | 90° |
β | 100.845 ± 0.006° |
γ | 90° |
Cell volume | 1510.91 ± 0.12 Å3 |
Cell temperature | 120 K |
Ambient diffraction temperature | 120 K |
Number of distinct elements | 7 |
Space group number | 14 |
Hermann-Mauguin space group symbol | P 1 21/c 1 |
Hall space group symbol | -P 2ybc |
Residual factor for all reflections | 0.0317 |
Residual factor for significantly intense reflections | 0.0209 |
Weighted residual factors for significantly intense reflections | 0.0466 |
Weighted residual factors for all reflections included in the refinement | 0.0488 |
Goodness-of-fit parameter for all reflections included in the refinement | 0.997 |
Diffraction radiation probe | x-ray |
Diffraction radiation wavelength | 0.71073 Å |
Diffraction radiation type | MoKα |
Diffraction radiation X-ray symbol | K-L~3~ |