Information card for entry 4515788
Chemical name | (phenylimido)trimethyl tungsten chloride |
Formula | C9 H14 Cl N W |
Calculated formula | C9 H14 Cl N W |
Title of publication | Exploration of Homogeneous Ethylene Dimerization Mediated by Tungsten Mono(imido) Complexes |
Authors of publication | Messinis, Antonis M.; Wright, William R. H.; Batsanov, Andrei S.; Howard, Judith A. K.; Hanton, Martin J.; Dyer, Philip W. |
Journal of publication | ACS Catalysis |
Year of publication | 2018 |
Journal volume | 8 |
Journal issue | 12 |
Pages of publication | 11235 |
a | 6.3483 ± 0.001 Å |
b | 7.2804 ± 0.0011 Å |
c | 11.9671 ± 0.0018 Å |
α | 90° |
β | 93.604 ± 0.01° |
γ | 90° |
Cell volume | 552 ± 0.15 Å3 |
Cell temperature | 120 K |
Ambient diffraction temperature | 120 K |
Number of distinct elements | 5 |
Space group number | 11 |
Hermann-Mauguin space group symbol | P 1 21/m 1 |
Hall space group symbol | -P 2yb |
Residual factor for all reflections | 0.0156 |
Residual factor for significantly intense reflections | 0.0152 |
Weighted residual factors for significantly intense reflections | 0.0404 |
Weighted residual factors for all reflections included in the refinement | 0.0405 |
Goodness-of-fit parameter for all reflections included in the refinement | 1.323 |
Diffraction radiation probe | x-ray |
Diffraction radiation wavelength | 0.71073 Å |
Diffraction radiation type | MoKα |