Information card for entry 4515802
Formula | C27 H43 Cl2 N2 P W |
Calculated formula | C27 H43 Cl2 N2 P W |
SMILES | [W](Cl)(Cl)([P](C)(C)C)(=Nc1c(cccc1C(C)C)C(C)C)=Nc1c(cccc1C(C)C)C(C)C |
Title of publication | Bis(Imido) Tungsten Complexes: Efficient Precatalysts for the Homogeneous Dimerization of Ethylene |
Authors of publication | Messinis, Antonis M.; Batsanov, Andrei S.; Wright, William R. H.; Howard, Judith A. K.; Hanton, Martin J.; Dyer, Philip W. |
Journal of publication | ACS Catalysis |
Year of publication | 2018 |
Journal volume | 8 |
Journal issue | 12 |
Pages of publication | 11249 |
a | 10.5486 ± 0.0009 Å |
b | 16.4202 ± 0.0014 Å |
c | 17.086 ± 0.0013 Å |
α | 90° |
β | 90° |
γ | 90° |
Cell volume | 2959.5 ± 0.4 Å3 |
Cell temperature | 120 ± 2 K |
Ambient diffraction temperature | 120 ± 2 K |
Number of distinct elements | 6 |
Space group number | 19 |
Hermann-Mauguin space group symbol | P 21 21 21 |
Hall space group symbol | P 2ac 2ab |
Residual factor for all reflections | 0.0393 |
Residual factor for significantly intense reflections | 0.0334 |
Weighted residual factors for significantly intense reflections | 0.0711 |
Weighted residual factors for all reflections included in the refinement | 0.0731 |
Goodness-of-fit parameter for all reflections included in the refinement | 1.092 |
Diffraction radiation probe | x-ray |
Diffraction radiation wavelength | 0.71073 Å |
Diffraction radiation type | MoKα |