Information card for entry 4515804
Formula | C52.4 H45 Cl2 N2 O2.2 W |
Calculated formula | C52 H44 Cl2 N2 O2 W |
Title of publication | Bis(Imido) Tungsten Complexes: Efficient Precatalysts for the Homogeneous Dimerization of Ethylene |
Authors of publication | Messinis, Antonis M.; Batsanov, Andrei S.; Wright, William R. H.; Howard, Judith A. K.; Hanton, Martin J.; Dyer, Philip W. |
Journal of publication | ACS Catalysis |
Year of publication | 2018 |
Journal volume | 8 |
Journal issue | 12 |
Pages of publication | 11249 |
a | 32.8492 ± 0.0013 Å |
b | 32.8492 ± 0.0013 Å |
c | 20.7376 ± 0.0009 Å |
α | 90° |
β | 90° |
γ | 120° |
Cell volume | 19379.3 ± 1.4 Å3 |
Cell temperature | 120 K |
Ambient diffraction temperature | 120 K |
Number of distinct elements | 6 |
Space group number | 148 |
Hermann-Mauguin space group symbol | R -3 :H |
Hall space group symbol | -R 3 |
Residual factor for all reflections | 0.0752 |
Residual factor for significantly intense reflections | 0.0414 |
Weighted residual factors for significantly intense reflections | 0.0761 |
Weighted residual factors for all reflections included in the refinement | 0.084 |
Goodness-of-fit parameter for all reflections included in the refinement | 0.965 |
Diffraction radiation wavelength | 0.71073 Å |
Diffraction radiation type | MoKα |