Information card for entry 4515807
Formula | C19 H34 Cl2 N2 O2 W |
Calculated formula | C19 H34 Cl2 N2 O2 W |
SMILES | [W]1(Cl)(Cl)([O](C)CC[O]1C)(=NC(C)C)=Nc1c(cccc1C(C)C)C(C)C |
Title of publication | Bis(Imido) Tungsten Complexes: Efficient Precatalysts for the Homogeneous Dimerization of Ethylene |
Authors of publication | Messinis, Antonis M.; Batsanov, Andrei S.; Wright, William R. H.; Howard, Judith A. K.; Hanton, Martin J.; Dyer, Philip W. |
Journal of publication | ACS Catalysis |
Year of publication | 2018 |
Journal volume | 8 |
Journal issue | 12 |
Pages of publication | 11249 |
a | 13.4052 ± 0.0006 Å |
b | 9.8029 ± 0.0006 Å |
c | 18.7197 ± 0.0009 Å |
α | 90° |
β | 109.016 ± 0.008° |
γ | 90° |
Cell volume | 2325.7 ± 0.2 Å3 |
Cell temperature | 120 ± 2 K |
Ambient diffraction temperature | 120 K |
Number of distinct elements | 6 |
Space group number | 14 |
Hermann-Mauguin space group symbol | P 1 21/n 1 |
Hall space group symbol | -P 2yn |
Residual factor for all reflections | 0.0301 |
Residual factor for significantly intense reflections | 0.025 |
Weighted residual factors for significantly intense reflections | 0.055 |
Weighted residual factors for all reflections included in the refinement | 0.0574 |
Goodness-of-fit parameter for all reflections included in the refinement | 1.092 |
Diffraction radiation wavelength | 0.71073 Å |
Diffraction radiation type | MoKα |