Information card for entry 4516609
Formula | C31 H31 F6 N4 O2 P Pt |
Calculated formula | C31 H31 F6 N4 O2 P Pt |
SMILES | [Pt]1(=C2N(C=CN2c2c1cc(cc2)C(=O)OCC)C)(C#[N]c1c(C)cccc1C)C#[N]c1c(C)cccc1C.[P](F)(F)(F)(F)(F)[F-] |
Title of publication | White Light Emission from Planar Remote Phosphor Based on NHC Cycloplatinated Complexes. |
Authors of publication | Fuertes, Sara; Chueca, Andrés J; Perálvarez, Mariano; Borja, Pilar; Torrell, Marc; Carreras, Josep; Sicilia, Violeta |
Journal of publication | ACS applied materials & interfaces |
Year of publication | 2016 |
Journal volume | 8 |
Journal issue | 25 |
Pages of publication | 16160 - 16169 |
a | 8.65366 ± 0.00018 Å |
b | 11.9779 ± 0.0002 Å |
c | 15.9929 ± 0.0002 Å |
α | 68.573 ± 0.0015° |
β | 86.3419 ± 0.0014° |
γ | 86.7648 ± 0.0016° |
Cell volume | 1539.01 ± 0.05 Å3 |
Cell temperature | 100 ± 2 K |
Ambient diffraction temperature | 100 ± 2 K |
Number of distinct elements | 7 |
Space group number | 2 |
Hermann-Mauguin space group symbol | P -1 |
Hall space group symbol | -P 1 |
Residual factor for all reflections | 0.0324 |
Residual factor for significantly intense reflections | 0.0273 |
Weighted residual factors for significantly intense reflections | 0.0553 |
Weighted residual factors for all reflections included in the refinement | 0.0574 |
Goodness-of-fit parameter for all reflections included in the refinement | 1.018 |
Diffraction radiation wavelength | 0.71073 Å |
Diffraction radiation type | MoKα |