Information card for entry 4516661
Formula |
C55 H40 Cl3 O3 P3 Si3 |
Calculated formula |
C55 H40 Cl3 O3 P3 Si3 |
Title of publication |
Silica-Supported Triptycene-Type Phosphine. Synthesis, Characterization, and Application to Pd-Catalyzed Suzuki‒Miyaura Cross-Coupling of Chloroarenes |
Authors of publication |
Iwai, Tomohiro; Konishi, Shota; Miyazaki, Tatsuya; Kawamorita, Soichiro; Yokokawa, Natsumi; Ohmiya, Hirohisa; Sawamura, Masaya |
Journal of publication |
ACS Catalysis |
Year of publication |
2015 |
Journal volume |
5 |
Journal issue |
12 |
Pages of publication |
7254 |
a |
15.5297 ± 0.0005 Å |
b |
15.5297 ± 0.0005 Å |
c |
24.1564 ± 0.0011 Å |
α |
90° |
β |
90° |
γ |
120° |
Cell volume |
5045.3 ± 0.3 Å3 |
Cell temperature |
150 K |
Ambient diffraction temperature |
150 K |
Number of distinct elements |
6 |
Space group number |
165 |
Hermann-Mauguin space group symbol |
P -3 c 1 |
Hall space group symbol |
-P 3 2"c |
Residual factor for significantly intense reflections |
0.0461 |
Weighted residual factors for all reflections included in the refinement |
0.1077 |
Goodness-of-fit parameter for all reflections included in the refinement |
1.139 |
Diffraction radiation wavelength |
0.71075 Å |
Diffraction radiation type |
MoKα |
Yes |
No |
No |